Reaction Details
TargetReverse transcriptase/RNaseH
LigandBDBM50070537
Substrate/Competitorn/a
Meas. Tech.ChEMBL_80270 (CHEMBL686917)
IC50 420±n/a nM
Citation Sahlberg, CNoréen, REngelhardt, PHögberg, MKangasmetsä, JVrang, LZhang, H Synthesis and anti-HIV activities of urea-PETT analogs belonging to a new class of potent non-nucleoside HIV-1 reverse transcriptase inhibitors. Bioorg Med Chem Lett8:1511-6 (1999) Reverse transcriptase/RNaseH
Name:Reverse transcriptase/RNaseH
Type:PROTEIN
Mol. Mass.:65229.15
Organism:Human immunodeficiency virus 1
Description:ChEMBL_1473730
Residue:566
BDBM50070537
NameBDBM50070537
Synonyms:1-(5-Chloro-pyridin-2-yl)-3-[2-(2,6-difluoro-phenyl)-ethyl]-urea | CHEMBL36930
TypeSmall organic molecule
Emp. Form.C14H12ClF2N3O
Mol. Mass.311.714
SMILESFc1cccc(F)c1CCNC(=O)Nc1ccc(Cl)cn1