Reaction Details
TargetReverse transcriptase/RNaseH
LigandBDBM50070531
Substrate/Competitorn/a
Meas. Tech.ChEMBL_195077 (CHEMBL797531)
IC50 2±n/a nM
Citation Sahlberg, CNoréen, REngelhardt, PHögberg, MKangasmetsä, JVrang, LZhang, H Synthesis and anti-HIV activities of urea-PETT analogs belonging to a new class of potent non-nucleoside HIV-1 reverse transcriptase inhibitors. Bioorg Med Chem Lett8:1511-6 (1999) Reverse transcriptase/RNaseH
Name:Reverse transcriptase/RNaseH
Type:PROTEIN
Mol. Mass.:65229.15
Organism:Human immunodeficiency virus 1
Description:ChEMBL_1473730
Residue:566
BDBM50070531
NameBDBM50070531
Synonyms:1-(5-Chloro-pyridin-2-yl)-3-[(1R,2R)-2-(2-fluoro-3,6-dimethoxy-phenyl)-cyclopropyl]-urea | CHEMBL38341
TypeSmall organic molecule
Emp. Form.C17H17ClFN3O3
Mol. Mass.365.787
SMILESCOc1ccc(OC)c([C@H]2C[C@H]2NC(=O)Nc2ccc(Cl)cn2)c1F