Reaction Details
TargetReverse transcriptase/RNaseH
LigandBDBM50070532
Substrate/Competitorn/a
Meas. Tech.ChEMBL_195077 (CHEMBL797531)
IC50 7±n/a nM
Citation Sahlberg, CNoréen, REngelhardt, PHögberg, MKangasmetsä, JVrang, LZhang, H Synthesis and anti-HIV activities of urea-PETT analogs belonging to a new class of potent non-nucleoside HIV-1 reverse transcriptase inhibitors. Bioorg Med Chem Lett8:1511-6 (1999) Reverse transcriptase/RNaseH
Name:Reverse transcriptase/RNaseH
Type:PROTEIN
Mol. Mass.:65229.15
Organism:Human immunodeficiency virus 1
Description:ChEMBL_1473730
Residue:566
BDBM50070532
NameBDBM50070532
Synonyms:1-(5-Bromo-pyridin-2-yl)-3-[(1R,2R)-2-(3-ethoxy-2-fluoro-6-methoxy-phenyl)-cyclopropyl]-urea | CHEMBL37834
TypeSmall organic molecule
Emp. Form.C18H19BrFN3O3
Mol. Mass.424.264
SMILESCCOc1ccc(OC)c([C@H]2C[C@H]2NC(=O)Nc2ccc(Br)cn2)c1F