Reaction Details
TargetReverse transcriptase/RNaseH
LigandBDBM1894
Substrate/Competitorn/a
Meas. Tech.ChEMBL_196515 (CHEMBL798329)
IC50 900±n/a nM
Citation Sahlberg, CNoréen, REngelhardt, PHögberg, MKangasmetsä, JVrang, LZhang, H Synthesis and anti-HIV activities of urea-PETT analogs belonging to a new class of potent non-nucleoside HIV-1 reverse transcriptase inhibitors. Bioorg Med Chem Lett8:1511-6 (1999) Reverse transcriptase/RNaseH
Name:Reverse transcriptase/RNaseH
Type:PROTEIN
Mol. Mass.:65229.15
Organism:Human immunodeficiency virus 1
Description:ChEMBL_1473730
Residue:566
BDBM1894
NameBDBM1894
Synonyms:1-(2-phenylethyl)-3-1,3-thiazol-2-ylthiourea LY73497 Phenylethylthiazolylthiourea (PETT) Analog
TypeSmall organic molecule
Emp. Form.C12H13N3S2
Mol. Mass.263.382
SMILESS=C(NCCc1ccccc1)Nc1nccs1