Reaction Details
TargetReverse transcriptase/RNaseH
LigandBDBM50070530
Substrate/Competitorn/a
Meas. Tech.ChEMBL_196517 (CHEMBL798331)
IC50 70±n/a nM
Citation Sahlberg, CNoréen, REngelhardt, PHögberg, MKangasmetsä, JVrang, LZhang, H Synthesis and anti-HIV activities of urea-PETT analogs belonging to a new class of potent non-nucleoside HIV-1 reverse transcriptase inhibitors. Bioorg Med Chem Lett8:1511-6 (1999) Reverse transcriptase/RNaseH
Name:Reverse transcriptase/RNaseH
Type:PROTEIN
Mol. Mass.:65229.15
Organism:Human immunodeficiency virus 1
Description:ChEMBL_1473730
Residue:566
BDBM50070530
NameBDBM50070530
Synonyms:1-[(1R,2R)-2-(2-Chloro-3-ethoxy-6-fluoro-phenyl)-cyclopropyl]-3-(5-cyano-pyridin-2-yl)-urea | CHEMBL38318
TypeSmall organic molecule
Emp. Form.C18H16ClFN4O2
Mol. Mass.374.797
SMILESCCOc1ccc(F)c([C@H]2C[C@H]2NC(=O)Nc2ccc(cn2)C#N)c1Cl