Reaction Details
TargetReverse transcriptase/RNaseH
LigandBDBM50070534
Substrate/Competitorn/a
Meas. Tech.ChEMBL_195077 (CHEMBL797531)
IC50 8±n/a nM
Citation Sahlberg, CNoréen, REngelhardt, PHögberg, MKangasmetsä, JVrang, LZhang, H Synthesis and anti-HIV activities of urea-PETT analogs belonging to a new class of potent non-nucleoside HIV-1 reverse transcriptase inhibitors. Bioorg Med Chem Lett8:1511-6 (1999) Reverse transcriptase/RNaseH
Name:Reverse transcriptase/RNaseH
Type:PROTEIN
Mol. Mass.:65229.15
Organism:Human immunodeficiency virus 1
Description:ChEMBL_1473730
Residue:566
BDBM50070534
NameBDBM50070534
Synonyms:1-(5-Chloro-pyridin-2-yl)-3-[2-(3-ethoxy-2-fluoro-6-methoxy-phenyl)-ethyl]-urea | CHEMBL35729
TypeSmall organic molecule
Emp. Form.C17H19ClFN3O3
Mol. Mass.367.802
SMILESCCOc1ccc(OC)c(CCNC(=O)Nc2ccc(Cl)cn2)c1F