Reaction Details
TargetMetabotropic glutamate receptor 4
LigandBDBM82355
Substrate/Competitorn/a
Meas. Tech.ChEBML_219020
EC50>1000000±n/a nM
Citation Madsen, UDumpis, MABräuner-Osborne, HPiotrovsky, LB Synthesis and pharmacology of N-alkylated derivatives of the excitotoxin ibotenic acid. Bioorg Med Chem Lett8:1563-8 (1999) Metabotropic glutamate receptor 4
Name:Metabotropic glutamate receptor 4
Type:Protein
Mol. Mass.:101899.95
Organism:Homo sapiens (Human)
Description:Q14833
Residue:912
BDBM82355
NameBDBM82355
Synonyms:Amino-(3-hydroxy-isoxazol-5-yl)-acetic acid(Ibotenic acid) CHEMBL284895 Ibotenic acid | NSC_1233
TypeSmall organic molecule
Emp. Form.C5H6N2O4
Mol. Mass.158.1121
SMILESNC(C(O)=O)c1cc(=O)[nH]o1