Reaction Details
TargetProthrombin
LigandBDBM50070596
Substrate/Competitorn/a
Meas. Tech.ChEBML_197824
Ki 70±n/a nM
Citation Lu, TTomczuk, BIllig, CRBone, RMurphy, LSpurlino, JSalemme, FRSoll, RM In vitro evaluation and crystallographic analysis of a new class of selective, non-amide-based thrombin inhibitors. Bioorg Med Chem Lett8:1595-600 (1999) Prothrombin
Name:Prothrombin
Type:Protein
Mol. Mass.:70029.57
Organism:Homo sapiens (Human)
Description:P00734
Residue:622
BDBM50070596
NameBDBM50070596
Synonyms:CHEMBL282549 | N-Methyl-N-{3-[2-(pyridin-4-ylamino)-ethoxy]-phenyl}-benzenesulfonamide
TypeSmall organic molecule
Emp. Form.C20H21N3O3S
Mol. Mass.383.464
SMILESCN(c1cccc(OCCNc2ccncc2)c1)S(=O)(=O)c1ccccc1