Reaction Details
TargetProthrombin
LigandBDBM50064653
Substrate/Competitorn/a
Meas. Tech.ChEBML_197824
Ki 11±n/a nM
Citation Lu, TTomczuk, BIllig, CRBone, RMurphy, LSpurlino, JSalemme, FRSoll, RM In vitro evaluation and crystallographic analysis of a new class of selective, non-amide-based thrombin inhibitors. Bioorg Med Chem Lett8:1595-600 (1999) Prothrombin
Name:Prothrombin
Type:Protein
Mol. Mass.:70029.57
Organism:Homo sapiens (Human)
Description:P00734
Residue:622
BDBM50064653
NameBDBM50064653
Synonyms:2-Chloro-benzenesulfonic acid 3-methyl-5-[2-(methyl-pyridin-4-yl-amino)-ethoxy]-phenyl ester | CHEMBL289951
TypeSmall organic molecule
Emp. Form.C21H21ClN2O4S
Mol. Mass.432.92
SMILESCN(CCOc1cc(C)cc(OS(=O)(=O)c2ccccc2Cl)c1)c1ccncc1