Reaction Details
TargetProthrombin
LigandBDBM50070747
Substrate/Competitorn/a
Meas. Tech.ChEBML_207952
pH8.3±n/a
IC50 2500±n/a nM
Commentsextracted
Citation Kundu, BBauser, MBetschinger, JKraas, WJung, G Identification of a potent analogue of Nazumamide A through iteration of combinatorial tetrapeptide libraries. Bioorg Med Chem Lett8:1669-72 (1999) Prothrombin
Name:Prothrombin
Type:Protein
Mol. Mass.:70029.57
Organism:Homo sapiens (Human)
Description:P00734
Residue:622
BDBM50070747
NameBDBM50070747
Synonyms:CHEMBL2372735 | Nazumamide A (NAZA) analogue
TypeSmall organic molecule
Emp. Form.C34H50N6O8
Mol. Mass.670.7962
SMILESCC[C@H](C)[C@H](NC(=O)[C@H](CCCCN)NC(=O)c1cc(O)ccc1O)C(=O)N[C@@H](Cc1ccccc1)C(=O)N[C@@H](CCCCN)C(O)=O