Reaction Details
TargetProthrombin
LigandBDBM50067796
Substrate/Competitorn/a
Meas. Tech.ChEBML_208345
Ki 0.500000±n/a nM
Citation Isaacs, RCCutrona, KJNewton, CLSanderson, PESolinsky, MGBaskin, EPChen, IWCooper, CMCook, JJGardell, SJLewis, SDLucas, RJLyle, EALynch, JJNaylor-Olsen, AMStranieri, MTVastag, KVacca, JP C6 modification of the pyridinone core of thrombin inhibitor L-374,087 as a means of enhancing its oral absorption. Bioorg Med Chem Lett8:1719-24 (1999) Prothrombin
Name:Prothrombin
Type:Protein
Mol. Mass.:70029.57
Organism:Homo sapiens (Human)
Description:P00734
Residue:622
BDBM50067796
NameBDBM50067796
Synonyms:CHEMBL11157 N-((6-amino-2-methylpyridin-3-yl)methyl)-2-(6-methyl-2-oxo-3-(phenylmethylsulfonamido)pyridin-1(2H)-yl)acetamide | N-(6-Amino-2-methyl-pyridin-3-ylmethyl)-2-(6-methyl-2-oxo-3-phenylmethanesulfonylamino-2H-pyridin-1-yl)-acetamide
TypeSmall organic molecule
Emp. Form.C22H25N5O4S
Mol. Mass.455.53
SMILESCc1nc(N)ccc1CNC(=O)Cn1c(C)ccc(NS(=O)(=O)Cc2ccccc2)c1=O