Reaction Details
TargetDihydroorotate dehydrogenase (quinone), mitochondrial
LigandBDBM50070844
Substrate/Competitorn/a
Meas. Tech.ChEBML_52890
Ki 23±n/a nM
Citation Batt, DGPetraitis, JJSherk, SRCopeland, RADowling, RLTaylor, TLJones, EAMagolda, RLJaffee, BD Heteroatom- and carbon-linked biphenyl analogs of Brequinar as immunosuppressive agents. Bioorg Med Chem Lett8:1745-50 (1999) Dihydroorotate dehydrogenase (quinone), mitochondrial
Name:Dihydroorotate dehydrogenase (quinone), mitochondrial
Type:Enzyme
Mol. Mass.:42881.33
Organism:Homo sapiens (Human)
Description:Q02127
Residue:395
BDBM50070844
NameBDBM50070844
Synonyms:CHEMBL49089 | Sodium; 6-fluoro-3-methyl-2-[1-methyl-7-(3-trifluoromethyl-phenyl)-1H-indol-3-yl]-quinoline-4-carboxylate
TypeSmall organic molecule
Emp. Form.C27H17F4N2O2
Mol. Mass.477.4302
SMILESCc1c(nc2ccc(F)cc2c1C([O-])=O)-c1cn(C)c2c(cccc12)-c1cccc(c1)C(F)(F)F