Reaction Details
TargetDihydroorotate dehydrogenase (quinone), mitochondrial
LigandBDBM50070851
Substrate/Competitorn/a
Meas. Tech.ChEBML_52890
Ki 22±n/a nM
Citation Batt, DGPetraitis, JJSherk, SRCopeland, RADowling, RLTaylor, TLJones, EAMagolda, RLJaffee, BD Heteroatom- and carbon-linked biphenyl analogs of Brequinar as immunosuppressive agents. Bioorg Med Chem Lett8:1745-50 (1999) Dihydroorotate dehydrogenase (quinone), mitochondrial
Name:Dihydroorotate dehydrogenase (quinone), mitochondrial
Type:Enzyme
Mol. Mass.:42881.33
Organism:Homo sapiens (Human)
Description:Q02127
Residue:395
BDBM50070851
NameBDBM50070851
Synonyms:CHEMBL48531 | Sodium; 6-fluoro-2-(6-methoxy-4-phenyl-2,3-dihydro-indol-1-yl)-3-methyl-quinoline-4-carboxylate
TypeSmall organic molecule
Emp. Form.C26H20FN2O3
Mol. Mass.427.4476
SMILESCOc1cc2N(CCc2c(c1)-c1ccccc1)c1nc2ccc(F)cc2c(C([O-])=O)c1C