Reaction Details
TargetDihydroorotate dehydrogenase (quinone), mitochondrial
LigandBDBM50070835
Substrate/Competitorn/a
Meas. Tech.ChEBML_52890
Ki 40±n/a nM
Citation Batt, DGPetraitis, JJSherk, SRCopeland, RADowling, RLTaylor, TLJones, EAMagolda, RLJaffee, BD Heteroatom- and carbon-linked biphenyl analogs of Brequinar as immunosuppressive agents. Bioorg Med Chem Lett8:1745-50 (1999) Dihydroorotate dehydrogenase (quinone), mitochondrial
Name:Dihydroorotate dehydrogenase (quinone), mitochondrial
Type:Enzyme
Mol. Mass.:42881.33
Organism:Homo sapiens (Human)
Description:Q02127
Residue:395
BDBM50070835
NameBDBM50070835
Synonyms:CHEMBL49840 | Sodium; 6-fluoro-2-[7-(2-methoxy-phenyl)-1-methyl-1H-indol-3-yl]-3-methyl-quinoline-4-carboxylate
TypeSmall organic molecule
Emp. Form.C27H20FN2O3
Mol. Mass.439.4583
SMILESCOc1ccccc1-c1cccc2c(cn(C)c12)-c1nc2ccc(F)cc2c(C([O-])=O)c1C