Reaction Details
TargetMu-type opioid receptor
LigandBDBM50070949
Substrate/Competitorn/a
Meas. Tech.ChEBML_138741
Ki 1654±n/a nM
Citation Tsai, YCLiou, JPLiao, RCheng, CYTao, PL C-alkylated spiro[benzofuran-3(2H),4'-1'-methyl-piperidine-7-ols] as potent opioids: a conformation-activity study. Bioorg Med Chem Lett8:1813-8 (1999) Mu-type opioid receptor
Name:Mu-type opioid receptor
Type:Enzyme Catalytic Domain
Mol. Mass.:11165.58
Organism:GUINEA PIG
Description:P97266
Residue:98
BDBM50070949
NameBDBM50070949
Synonyms:1'-methylspiro[2,3-dihydrobenzo[b]furan-3,4'-(hexahydropyridine)]-7-ol | CHEMBL297281
TypeSmall organic molecule
Emp. Form.C13H17NO2
Mol. Mass.219.2796
SMILESCN1CCC2(COc3c2cccc3O)CC1