Reaction Details
TargetKappa-type opioid receptor
LigandBDBM50026752
Substrate/Competitorn/a
Meas. Tech.ChEBML_146389
Ki>100000±n/a nM
Citation Tsai, YCLiou, JPLiao, RCheng, CYTao, PL C-alkylated spiro[benzofuran-3(2H),4'-1'-methyl-piperidine-7-ols] as potent opioids: a conformation-activity study. Bioorg Med Chem Lett8:1813-8 (1999) Kappa-type opioid receptor
Name:Kappa-type opioid receptor
Type:G Protein-Coupled Receptor (GPCR)
Mol. Mass.:42744.99
Organism:Cavia porcellus (domestic guinea pig)
Description:P41144
Residue:380
BDBM50026752
NameBDBM50026752
Synonyms:1-Methyl-4-phenyl-piperidine-4-carboxylic acid ethyl ester 4-Ethoxycarbonyl-1-methyl-4-phenyl-piperidinium Demerol MEPERIDINE HYDROCHLORIDE Pethidine | ethyl 1-methyl-4-phenylpiperidine-4-carboxylate
TypeSmall organic molecule
Emp. Form.C15H21NO2
Mol. Mass.247.3327
SMILESCCOC(=O)C1(CCN(C)CC1)c1ccccc1