Reaction Details
TargetReverse transcriptase/RNaseH
LigandBDBM50071365
Substrate/Competitorn/a
Meas. Tech.ChEMBL_195070 (CHEMBL797525)
IC50 630±n/a nM
Citation Dyatkin, ABBrickwood, JRProudfoot, JR A dipyrido [2,3-b:3',2'-f]azepine analog of the HIV-1 reverse transcriptase inhibitor nevirapine. Bioorg Med Chem Lett8:2169-72 (1999) Reverse transcriptase/RNaseH
Name:Reverse transcriptase/RNaseH
Type:PROTEIN
Mol. Mass.:65229.15
Organism:Human immunodeficiency virus 1
Description:ChEMBL_1473730
Residue:566
BDBM50071365
NameBDBM50071365
Synonyms:5-Cyclopropyl-5H-4,5,6-triaza-dibenzo[a,d]cycloheptene | CHEMBL69855
TypeSmall organic molecule
Emp. Form.C15H13N3
Mol. Mass.235.2838
SMILESC1CC1N1c2ncccc2C=Cc2cccnc12