Reaction Details
TargetReverse transcriptase/RNaseH
LigandBDBM50071364
Substrate/Competitorn/a
Meas. Tech.ChEMBL_195074 (CHEMBL872977)
IC50 40±n/a nM
Citation Dyatkin, ABBrickwood, JRProudfoot, JR A dipyrido [2,3-b:3',2'-f]azepine analog of the HIV-1 reverse transcriptase inhibitor nevirapine. Bioorg Med Chem Lett8:2169-72 (1999) Reverse transcriptase/RNaseH
Name:Reverse transcriptase/RNaseH
Type:PROTEIN
Mol. Mass.:65229.15
Organism:Human immunodeficiency virus 1
Description:ChEMBL_1473730
Residue:566
BDBM50071364
NameBDBM50071364
Synonyms:5-Ethyl-5H-4,5,6-triaza-dibenzo[a,d]cycloheptene | CHEMBL308907
TypeSmall organic molecule
Emp. Form.C14H13N3
Mol. Mass.223.2731
SMILESCCN1c2ncccc2C=Cc2cccnc12