Reaction Details
TargetNeuronal acetylcholine receptor; alpha2/beta4
LigandBDBM50071366
Substrate/Competitorn/a
Meas. Tech.ChEMBL_143228 (CHEMBL750089)
EC50 87000±n/a nM
Citation Vernier, JMHolsenback, HCosford, NDWhitten, JPMenzaghi, FReid, RRao, TSSacaan, AILloyd, GKSuto, CMChavez-Noriega, LEWashburn, MSUrrutia, AMcDonald, IA Conformationally restricted analogues of nicotine and anabasine. Bioorg Med Chem Lett8:2173-8 (1999) Neuronal acetylcholine receptor; alpha2/beta4
Name:Neuronal acetylcholine receptor; alpha2/beta4
Type:n/a
Mol. Mass.:n/a
Description:ASSAY_ID of ChEMBL is 2150172
Components:This complex has 2 components.
Component 1
Name:Neuronal acetylcholine receptor subunit beta-4
Synonyms:ACHB4_HUMAN Cholinergic, Nicotinic Alpha6Beta3Beta4Alpha5 Nicotinic acetylcholine receptor alpha6/alpha3/beta4
Type:Enzyme Catalytic Domain
Mol. Mass.:56388.51
Organism:Homo sapiens (Human)
Description:Cholinergic, Nicotinic Alpha6Beta3Beta4Alpha5 0 HUMAN::P30926
Residue:498
Component 2
Name:Neuronal acetylcholine receptor subunit alpha-2
Synonyms:ACHA2_HUMAN Neuronal acetylcholine receptor; alpha2/beta2
Type:Enzyme Catalytic Domain
Mol. Mass.:59759.69
Organism:Homo sapiens (Human)
Description:Cholinergic, Nicotinic Alpha2Beta2 0 HUMAN::Q15822
Residue:529
BDBM50071366
NameBDBM50071366
Synonyms:7-Methoxy-2,3,3a,4,5,9b-hexahydro-1H-pyrrolo[3,2-h]isoquinoline | CHEMBL71486
TypeSmall organic molecule
Emp. Form.C12H16N2O
Mol. Mass.204.2682
SMILESCOc1cc2CCC3CCNC3c2cn1