Reaction Details
TargetCannabinoid receptor 1
LigandBDBM50067499
Substrate/Competitorn/a
Meas. Tech.ChEMBL_46289 (CHEMBL657997)
Ki 0.730000±n/a nM
Citation Liddle, JHuffman, JWWiley, JLMartin, BR Enantioselective synthesis and pharmacology of 11-hydroxy-(1'S,2'R)-dimethylheptyl-delta 8-THC. Bioorg Med Chem Lett8:2223-6 (1999) Cannabinoid receptor 1
Name:Cannabinoid receptor 1
Type:G Protein-Coupled Receptor (GPCR)
Mol. Mass.:52856.55
Organism:Rattus norvegicus (rat)
Description:P20272
Residue:473
BDBM50067499
NameBDBM50067499
Synonyms:(6aR,10aR)-3(1,1-dimethylheptyl)-9-hydroxymethyl)-6,6-dimethyl-6a,7,10,10a-tetrahydro-6H-benzo[c]chromen-1-ol (6aR,10aR)-9-(hydroxymethyl)-6,6-dimethyl-3-(2-methyloctan-2-yl)-6a,7,10,10a-tetrahydro-6H-benzo[c]chromen-1-ol HU-210 | US9365534, HU-210
TypeSmall organic molecule
Emp. Form.C25H38O3
Mol. Mass.386.5674
SMILESCCCCCCC(C)(C)c1cc(O)c2[C@@H]3CC(CO)=CC[C@H]3C(C)(C)Oc2c1