Reaction Details
TargetEndothelin receptor type B
LigandBDBM50071426
Substrate/Competitorn/a
Meas. Tech.ChEBML_64012
Ki 0.700000±n/a nM
Citation Sakaki, JMurata, TYuumoto, YNakamura, ITrueh, TPitterna, TIwasaki, GOda, KYamamura, THayakawa, K Discovery of IRL 3461: a novel and potent endothelin antagonist with balanced ETA/ETB affinity. Bioorg Med Chem Lett8:2241-6 (1999) Endothelin receptor type B
Name:Endothelin receptor type B
Type:Enzyme Catalytic Domain
Mol. Mass.:49664.00
Organism:Homo sapiens (Human)
Description:ENDOTHELIN B EDNRB HUMAN::P24530
Residue:442
BDBM50071426
NameBDBM50071426
Synonyms:CHEMBL73835 | N-[(R)-1-[1-(Butane-1-sulfonylaminocarbonyl)-propylcarbamoyl]-2-(4-isoxazol-5-yl-phenyl)-ethyl]-3,5,N-trimethyl-benzamide
TypeSmall organic molecule
Emp. Form.C30H38N4O6S
Mol. Mass.582.711
SMILESCCCCS(=O)(=O)NC(=O)C(CC)NC(=O)[C@@H](Cc1ccc(cc1)-c1ccno1)N(C)C(=O)c1cc(C)cc(C)c1