Reaction Details
TargetEndothelin receptor type B
LigandBDBM50071433
Substrate/Competitorn/a
Meas. Tech.ChEBML_64012
Ki 1±n/a nM
Citation Sakaki, JMurata, TYuumoto, YNakamura, ITrueh, TPitterna, TIwasaki, GOda, KYamamura, THayakawa, K Discovery of IRL 3461: a novel and potent endothelin antagonist with balanced ETA/ETB affinity. Bioorg Med Chem Lett8:2241-6 (1999) Endothelin receptor type B
Name:Endothelin receptor type B
Type:Enzyme Catalytic Domain
Mol. Mass.:49664.00
Organism:Homo sapiens (Human)
Description:ENDOTHELIN B EDNRB HUMAN::P24530
Residue:442
BDBM50071433
NameBDBM50071433
Synonyms:(S)-2-{(R)-3-Biphenyl-4-yl-2-[(3,5-dimethyl-benzoyl)-methyl-amino]-propionylamino}-3-(1H-indol-3-yl)-propionic acid | CHEMBL72410
TypeSmall organic molecule
Emp. Form.C36H35N3O4
Mol. Mass.573.6808
SMILESCN([C@H](Cc1ccc(cc1)-c1ccccc1)C(=O)N[C@@H](Cc1c[nH]c2ccccc12)C(O)=O)C(=O)c1cc(C)cc(C)c1