Reaction Details
TargetEndothelin receptor type B
LigandBDBM50071437
Substrate/Competitorn/a
Meas. Tech.ChEBML_64012
Ki 0.230000±n/a nM
Citation Sakaki, JMurata, TYuumoto, YNakamura, ITrueh, TPitterna, TIwasaki, GOda, KYamamura, THayakawa, K Discovery of IRL 3461: a novel and potent endothelin antagonist with balanced ETA/ETB affinity. Bioorg Med Chem Lett8:2241-6 (1999) Endothelin receptor type B
Name:Endothelin receptor type B
Type:Enzyme Catalytic Domain
Mol. Mass.:49664.00
Organism:Homo sapiens (Human)
Description:ENDOTHELIN B EDNRB HUMAN::P24530
Residue:442
BDBM50071437
NameBDBM50071437
Synonyms:CHEMBL308102 | N-[(R)-1-[(S)-1-(1H-Indol-3-ylmethyl)-2-oxo-2-(prop-2-ene-1-sulfonylamino)-ethylcarbamoyl]-2-(4-isoxazol-5-yl-phenyl)-ethyl]-3,5,N-trimethyl-benzamide
TypeSmall organic molecule
Emp. Form.C36H37N5O6S
Mol. Mass.667.774
SMILESCN([C@H](Cc1ccc(cc1)-c1ccno1)C(=O)N[C@@H](Cc1c[nH]c2ccccc12)C(=O)NS(=O)(=O)CC=C)C(=O)c1cc(C)cc(C)c1