Reaction Details
TargetEndothelin receptor type B
LigandBDBM50071435
Substrate/Competitorn/a
Meas. Tech.ChEBML_64012
Ki 0.230000±n/a nM
Citation Sakaki, JMurata, TYuumoto, YNakamura, ITrueh, TPitterna, TIwasaki, GOda, KYamamura, THayakawa, K Discovery of IRL 3461: a novel and potent endothelin antagonist with balanced ETA/ETB affinity. Bioorg Med Chem Lett8:2241-6 (1999) Endothelin receptor type B
Name:Endothelin receptor type B
Type:Enzyme Catalytic Domain
Mol. Mass.:49664.00
Organism:Homo sapiens (Human)
Description:ENDOTHELIN B EDNRB HUMAN::P24530
Residue:442
BDBM50071435
NameBDBM50071435
Synonyms:(S)-2-[(R)-2-[(3,5-Dimethyl-benzoyl)-methyl-amino]-3-(4-thiophen-3-yl-phenyl)-propionylamino]-3-(1H-indol-3-yl)-propionic acid | CHEMBL305462
TypeSmall organic molecule
Emp. Form.C34H33N3O4S
Mol. Mass.579.709
SMILESCN([C@H](Cc1ccc(cc1)-c1ccsc1)C(=O)N[C@@H](Cc1c[nH]c2ccccc12)C(O)=O)C(=O)c1cc(C)cc(C)c1