Reaction Details
TargetEndothelin-1 receptor
LigandBDBM50071442
Substrate/Competitorn/a
Meas. Tech.ChEBML_65820
Ki 8.6±n/a nM
Citation Sakaki, JMurata, TYuumoto, YNakamura, ITrueh, TPitterna, TIwasaki, GOda, KYamamura, THayakawa, K Discovery of IRL 3461: a novel and potent endothelin antagonist with balanced ETA/ETB affinity. Bioorg Med Chem Lett8:2241-6 (1999) Endothelin-1 receptor
Name:Endothelin-1 receptor
Type:Enzyme Catalytic Domain
Mol. Mass.:48736.88
Organism:Homo sapiens (Human)
Description:P25101
Residue:427
BDBM50071442
NameBDBM50071442
Synonyms:CHEMBL72358 | N-[(R)-1-[2-(Butane-1-sulfonylamino)-1-cyclohexyl-2-oxo-ethylcarbamoyl]-2-(4-isoxazol-5-yl-phenyl)-ethyl]-3,5,N-trimethyl-benzamide
TypeSmall organic molecule
Emp. Form.C34H44N4O6S
Mol. Mass.636.801
SMILESCCCCS(=O)(=O)NC(=O)C(NC(=O)[C@@H](Cc1ccc(cc1)-c1ccno1)N(C)C(=O)c1cc(C)cc(C)c1)C1CCCCC1