Reaction Details
TargetEndothelin receptor type B
LigandBDBM50071425
Substrate/Competitorn/a
Meas. Tech.ChEBML_63847
Ki 1.2±n/a nM
Citation Sakaki, JMurata, TYuumoto, YNakamura, IHayakawa, K Stereoselective synthesis of a novel and bifunctional endothelin antagonist, IRL 3630. Bioorg Med Chem Lett8:2247-52 (1999) Endothelin receptor type B
Name:Endothelin receptor type B
Type:Enzyme Catalytic Domain
Mol. Mass.:49664.00
Organism:Homo sapiens (Human)
Description:ENDOTHELIN B EDNRB HUMAN::P24530
Residue:442
BDBM50071425
NameBDBM50071425
Synonyms:CHEMBL311854 | N-[(R)-1-[(S)-1-(Butane-1-sulfonylaminocarbonyl)-2-methyl-propylcarbamoyl]-2-(4-isoxazol-5-yl-phenyl)-ethyl]-3,5,N-trimethyl-benzamide
TypeSmall organic molecule
Emp. Form.C31H40N4O6S
Mol. Mass.596.738
SMILESCCCCS(=O)(=O)NC(=O)[C@@H](NC(=O)[C@@H](Cc1ccc(cc1)-c1ccno1)N(C)C(=O)c1cc(C)cc(C)c1)C(C)C