Reaction Details
TargetProthrombin
LigandBDBM50071568
Substrate/Competitorn/a
Meas. Tech.ChEBML_208893
Ki 1.6±n/a nM
Citation Ogbu, COQabar, MNBoatman, PDUrban, JMeara, JPFerguson, MDTulinsky, JLum, CBabu, SBlaskovich, MANakanishi, HRuan, FCao, BMinarik, RLittle, TNelson, SNguyen, MGall, AKahn, M Highly efficient and versatile synthesis of libraries of constrained beta-strand mimetics. Bioorg Med Chem Lett8:2321-6 (1999) Prothrombin
Name:Prothrombin
Type:Protein
Mol. Mass.:70029.57
Organism:Homo sapiens (Human)
Description:P00734
Residue:622
BDBM50071568
NameBDBM50071568
Synonyms:2-Amino-2-benzyl-7-methyl-1,3-dioxo-2,3,5,8-tetrahydro-1H-pyrazolo[1,2-a]pyridazine-5-carboxylic acid [5-amino-1-(4-carbamoyl-benzylaminooxalyl)-pentyl]-amide | CHEMBL75569
TypeSmall organic molecule
Emp. Form.C31H37N7O6
Mol. Mass.603.6688
SMILESCC1=CC(N2N(C1)C(=O)C(N)(Cc1ccccc1)C2=O)C(=O)NC(CCCCN)C(=O)C(=O)NCc1ccc(cc1)C(N)=O