Reaction Details
TargetTryptase beta-2/delta/gamma
LigandBDBM50216213
Substrate/Competitorn/a
Meas. Tech.ChEMBL_210831 (CHEMBL811860)
Ki 5.9±n/a nM
Citation Ogbu, COQabar, MNBoatman, PDUrban, JMeara, JPFerguson, MDTulinsky, JLum, CBabu, SBlaskovich, MANakanishi, HRuan, FCao, BMinarik, RLittle, TNelson, SNguyen, MGall, AKahn, M Highly efficient and versatile synthesis of libraries of constrained beta-strand mimetics. Bioorg Med Chem Lett8:2321-6 (1999) Tryptase beta-2/delta/gamma
Name:Tryptase beta-2/delta/gamma
Synonyms:Tryptase
Type:n/a
Mol. Mass.:n/a
Description:ASSAY_ID of ChEMBL is 1510505
Components:This complex has 3 components.
Component 1
Name:Tryptase gamma
Type:PROTEIN
Mol. Mass.:33817.52
Organism:Homo sapiens (Human)
Description:ChEMBL_210833
Residue:321
Component 2
Name:Tryptase beta-2
Synonyms:TPS2 TRYB2_HUMAN Tryptase II Tryptase-2
Type:PROTEIN
Mol. Mass.:30518.79
Organism:Homo sapiens (Human)
Description:ChEMBL_210702
Residue:275
Component 3
Name:Tryptase delta
Synonyms:Delta-tryptase Mast cell mMCP-7-like TRYD_HUMAN Tryptase-3
Type:PROTEIN
Mol. Mass.:26578.73
Organism:Homo sapiens (Human)
Description:ChEMBL_104777
Residue:242
BDBM50216213
NameBDBM50216213
Synonyms:CHEMBL306744
TypeSmall organic molecule
Emp. Form.C37H41N7O6
Mol. Mass.679.7647
SMILESCC1=CC(C(=O)NC(CCCCN)C(=O)C(=O)NCCc2ccc(cc2)C(N)=O)n2n(C1)c(=O)n(C(c1ccccc1)c1ccccc1)c2=O