Reaction Details
TargetGag-Pol polyprotein [489-587]
LigandBDBM50071619
Substrate/Competitorn/a
Meas. Tech.ChEBML_159306
IC50 10±n/a nM
Citation Ro, SBaek, SGLee, BPark, CChoy, NLee, CSSon, YCChoi, HKoh, JSYoon, HKim, SCOk, JH NMR and topochemical studies of peptidomimetic HIV-I protease inhibitors containing a cis-epoxide amide isostere. Bioorg Med Chem Lett8:2423-6 (1999) Gag-Pol polyprotein [489-587]
Name:Gag-Pol polyprotein [489-587]
Type:Enzyme Subunit
Mol. Mass.:10781.16
Organism:Human immunodeficiency virus type 1
Description:P04585[489-587]
Residue:99
BDBM50071619
NameBDBM50071619
Synonyms:(S)-N*1*-((S)-1-{(2R,3S)-3-[((R)-1-Methoxycarbamoyl-2-methyl-propylcarbamoyl)-methyl]-oxiranyl}-2-phenyl-ethyl)-2-[(quinoline-2-carbonyl)-amino]-succinamide | CHEMBL78312
TypeSmall organic molecule
Emp. Form.C32H38N6O7
Mol. Mass.618.6801
SMILESCONC(=O)[C@H](NC(=O)C[C@@H]1O[C@@H]1[C@H](Cc1ccccc1)NC(=O)[C@H](CC(N)=O)NC(=O)c1ccc2ccccc2n1)C(C)C