Reaction Details
TargetAlpha-1B adrenergic receptor
LigandBDBM50071651
Substrate/Competitorn/a
Meas. Tech.ChEBML_32895
Ki 20±n/a nM
Citation Nerenberg, JBErb, JMThompson, WJLee, HYGuare, JPMunson, PMBergman, JMHuff, JRBroten, TPChang, RSChen, TBO'Malley, SSchorn, TWScott, AL Design and synthesis of N-alkylated saccharins as selective alpha-1a adrenergic receptor antagonists. Bioorg Med Chem Lett8:2467-72 (1999) Alpha-1B adrenergic receptor
Name:Alpha-1B adrenergic receptor
Type:Enzyme
Mol. Mass.:56862.13
Organism:Homo sapiens (Human)
Description:P35368
Residue:520
BDBM50071651
NameBDBM50071651
Synonyms:3-{1-[4-(5-Methyl-1,1,3-trioxo-1,3-dihydro-1lambda*6*-benzo[d]isothiazol-2-yl)-butyl]-piperidin-4-yl}-3H-benzooxazol-2-one | CHEMBL81006
TypeSmall organic molecule
Emp. Form.C24H27N3O5S
Mol. Mass.469.553
SMILESCc1ccc2c(c1)C(=O)N(CCCCN1CCC(CC1)n1c3ccccc3oc1=O)S2(=O)=O