Reaction Details
TargetAlpha-1A adrenergic receptor
LigandBDBM50071656
Substrate/Competitorn/a
Meas. Tech.ChEMBL_32878 (CHEMBL648631)
Ki 0.280000±n/a nM
Citation Nerenberg, JBErb, JMThompson, WJLee, HYGuare, JPMunson, PMBergman, JMHuff, JRBroten, TPChang, RSChen, TBO'Malley, SSchorn, TWScott, AL Design and synthesis of N-alkylated saccharins as selective alpha-1a adrenergic receptor antagonists. Bioorg Med Chem Lett8:2467-72 (1999) Alpha-1A adrenergic receptor
Name:Alpha-1A adrenergic receptor
Type:Cell-surface receptors
Mol. Mass.:51511.67
Organism:Homo sapiens (Human)
Description:P35348
Residue:466
BDBM50071656
NameBDBM50071656
Synonyms:2-{4-[4-(2-Oxo-2,3-dihydro-benzoimidazol-1-yl)-piperidin-1-yl]-butyl}-isoindole-1,3-dione | CHEMBL311247
TypeSmall organic molecule
Emp. Form.C24H26N4O3
Mol. Mass.418.4882
SMILESO=C1N(CCCCN2CCC(CC2)n2c3ccccc3[nH]c2=O)C(=O)c2ccccc12