Reaction Details
TargetAlpha-1A adrenergic receptor
LigandBDBM50071657
Substrate/Competitorn/a
Meas. Tech.ChEMBL_32878 (CHEMBL648631)
Ki 20±n/a nM
Citation Nerenberg, JBErb, JMThompson, WJLee, HYGuare, JPMunson, PMBergman, JMHuff, JRBroten, TPChang, RSChen, TBO'Malley, SSchorn, TWScott, AL Design and synthesis of N-alkylated saccharins as selective alpha-1a adrenergic receptor antagonists. Bioorg Med Chem Lett8:2467-72 (1999) Alpha-1A adrenergic receptor
Name:Alpha-1A adrenergic receptor
Type:Cell-surface receptors
Mol. Mass.:51511.67
Organism:Homo sapiens (Human)
Description:P35348
Residue:466
BDBM50071657
NameBDBM50071657
Synonyms:5,7-Dimethyl-3-{1-[4-(1,1,3-trioxo-1,3-dihydro-1lambda*6*-benzo[d]isothiazol-2-yl)-butyl]-piperidin-4-yl}-3H-benzooxazol-2-one | CHEMBL420578
TypeSmall organic molecule
Emp. Form.C25H29N3O5S
Mol. Mass.483.58
SMILESCc1cc(C)c2oc(=O)n(C3CCN(CCCCN4C(=O)c5ccccc5S4(=O)=O)CC3)c2c1