Reaction Details
TargetAlpha-1D adrenergic receptor
LigandBDBM50071652
Substrate/Competitorn/a
Meas. Tech.ChEBML_33019
Ki 25±n/a nM
Citation Nerenberg, JBErb, JMThompson, WJLee, HYGuare, JPMunson, PMBergman, JMHuff, JRBroten, TPChang, RSChen, TBO'Malley, SSchorn, TWScott, AL Design and synthesis of N-alkylated saccharins as selective alpha-1a adrenergic receptor antagonists. Bioorg Med Chem Lett8:2467-72 (1999) Alpha-1D adrenergic receptor
Name:Alpha-1D adrenergic receptor
Type:Enzyme Catalytic Domain
Mol. Mass.:60485.82
Organism:Homo sapiens (Human)
Description:adrenergic Alpha1D ADRA1D HUMAN::P25100
Residue:572
BDBM50071652
NameBDBM50071652
Synonyms:6-Fluoro-3-{1-[4-(1,1,3-trioxo-1,3-dihydro-1lambda*6*-benzo[d]isothiazol-2-yl)-butyl]-piperidin-4-yl}-3H-benzooxazol-2-one | CHEMBL83272
TypeSmall organic molecule
Emp. Form.C23H24FN3O5S
Mol. Mass.473.517
SMILESFc1ccc2n(C3CCN(CCCCN4C(=O)c5ccccc5S4(=O)=O)CC3)c(=O)oc2c1