Reaction Details
TargetPeptide deformylase
LigandBDBM50071663
Substrate/Competitorn/a
Meas. Tech.ChEBML_154319
Ki 125000±n/a nM
Citation Hu, YJRajagopalan, PTPei, D H-phosphonate derivatives as novel peptide deformylase inhibitors. Bioorg Med Chem Lett8:2479-82 (1999) Peptide deformylase
Name:Peptide deformylase
Type:Enzyme
Mol. Mass.:19323.16
Organism:Escherichia coli (strain K12)
Description:The pdf gene from E. coli K12 was cloned and protein was expressed and purified from E. coli BL21(DE3).
Residue:169
BDBM50071663
NameBDBM50071663
Synonyms:CHEMBL309477 | H-PHOSPHONATE DERIVATIVE
TypeSmall organic molecule
Emp. Form.C18H28N3O7P
Mol. Mass.429.4046
SMILESCCCCC(O[PH+](O)[O-])C(=O)NC(CC(C)C)C(=O)Nc1ccc(cc1)[N+]([O-])=O