Reaction Details
TargetProthrombin
LigandBDBM50071723
Substrate/Competitorn/a
Meas. Tech.ChEBML_208312
Ki 3.3±n/a nM
Citation Lee, KJung, WHPark, CWHong, CYKim, ICKim, SOh, YSKwon, OHLee, SHPark, HDKim, SWLee, YHYoo, YJ Benzylamine-based selective and orally bioavailable inhibitors of thrombin. Bioorg Med Chem Lett8:2563-8 (1999) Prothrombin
Name:Prothrombin
Type:Protein
Mol. Mass.:70029.57
Organism:Homo sapiens (Human)
Description:P00734
Residue:622
BDBM50071723
NameBDBM50071723
Synonyms:(S)-3-(4-Aminomethyl-phenyl)-N-cyclopentyl-N-methyl-2-(6,7,8,9-tetrahydro-5H-benzocycloheptene-2-sulfonylamino)-propionamide | CHEMBL316205
TypeSmall organic molecule
Emp. Form.C27H37N3O3S
Mol. Mass.483.666
SMILESCN(C1CCCC1)C(=O)[C@H](Cc1ccc(CN)cc1)NS(=O)(=O)c1ccc2CCCCCc2c1