Reaction Details
TargetReverse transcriptase/RNaseH
LigandBDBM50071773
Substrate/Competitorn/a
Meas. Tech.ChEMBL_197451 (CHEMBL804236)
IC50 9000±n/a nM
Citation Milton, JSlater, MJBird, AJSpinks, DScott, GPrice, CEDowning, SGreen, DVMadar, SBethell, RStammers, DK Biaryl acids: novel non-nucleoside inhibitors of HIV reverse transcriptase types 1 and 2. Bioorg Med Chem Lett8:2623-8 (1999) Reverse transcriptase/RNaseH
Name:Reverse transcriptase/RNaseH
Type:PROTEIN
Mol. Mass.:65229.15
Organism:Human immunodeficiency virus 1
Description:ChEMBL_1473730
Residue:566
BDBM50071773
NameBDBM50071773
Synonyms:2-[5-(2-carboxy-4-chlorophenylcarbamoyl)pentylcarboxamido]-5-chlorobenzoic acid | CHEMBL88459
TypeSmall organic molecule
Emp. Form.C21H20Cl2N2O6
Mol. Mass.467.299
SMILESOC(=O)c1cc(Cl)ccc1NC(=O)CCCCCC(=O)Nc1ccc(Cl)cc1C(O)=O