Reaction Details
TargetReverse transcriptase/RNaseH
LigandBDBM50071771
Substrate/Competitorn/a
Meas. Tech.ChEMBL_197451 (CHEMBL804236)
IC50 35000±n/a nM
Citation Milton, JSlater, MJBird, AJSpinks, DScott, GPrice, CEDowning, SGreen, DVMadar, SBethell, RStammers, DK Biaryl acids: novel non-nucleoside inhibitors of HIV reverse transcriptase types 1 and 2. Bioorg Med Chem Lett8:2623-8 (1999) Reverse transcriptase/RNaseH
Name:Reverse transcriptase/RNaseH
Type:PROTEIN
Mol. Mass.:65229.15
Organism:Human immunodeficiency virus 1
Description:ChEMBL_1473730
Residue:566
BDBM50071771
NameBDBM50071771
Synonyms:5-bromo-2-{[(5-{[(4-bromo-2-carboxyphenyl)amino]carbonyl}pyridin-2-yl)carbonyl]amino}benzoic acid | CHEMBL89319
TypeSmall organic molecule
Emp. Form.C21H13Br2N3O6
Mol. Mass.563.152
SMILESOC(=O)c1cc(Br)ccc1NC(=O)c1ccc(nc1)C(=O)Nc1ccc(Br)cc1C(O)=O