Reaction Details
TargetReverse transcriptase/RNaseH
LigandBDBM50071765
Substrate/Competitorn/a
Meas. Tech.ChEMBL_196364 (CHEMBL805997)
IC50 4300±n/a nM
Citation Milton, JSlater, MJBird, AJSpinks, DScott, GPrice, CEDowning, SGreen, DVMadar, SBethell, RStammers, DK Biaryl acids: novel non-nucleoside inhibitors of HIV reverse transcriptase types 1 and 2. Bioorg Med Chem Lett8:2623-8 (1999) Reverse transcriptase/RNaseH
Name:Reverse transcriptase/RNaseH
Type:PROTEIN
Mol. Mass.:65229.15
Organism:Human immunodeficiency virus 1
Description:ChEMBL_1473730
Residue:566
BDBM50071765
NameBDBM50071765
Synonyms:2-[4-(2-carboxy-4-methoxyphenylcarbamoyl)butylcarboxamido]-5-methoxybenzoic acid | CHEMBL88463
TypeSmall organic molecule
Emp. Form.C22H24N2O8
Mol. Mass.444.4346
SMILESCOc1ccc(NC(=O)CCCCC(=O)Nc2ccc(OC)cc2C(O)=O)c(c1)C(O)=O