Reaction Details
TargetReverse transcriptase/RNaseH
LigandBDBM50071767
Substrate/Competitorn/a
Meas. Tech.ChEMBL_196364 (CHEMBL805997)
IC50 6700±n/a nM
Citation Milton, JSlater, MJBird, AJSpinks, DScott, GPrice, CEDowning, SGreen, DVMadar, SBethell, RStammers, DK Biaryl acids: novel non-nucleoside inhibitors of HIV reverse transcriptase types 1 and 2. Bioorg Med Chem Lett8:2623-8 (1999) Reverse transcriptase/RNaseH
Name:Reverse transcriptase/RNaseH
Type:PROTEIN
Mol. Mass.:65229.15
Organism:Human immunodeficiency virus 1
Description:ChEMBL_1473730
Residue:566
BDBM50071767
NameBDBM50071767
Synonyms:2-({6-[(2-carboxy-4-hydroxyphenyl)amino]-6-oxohexanoyl}amino)-5-hydroxybenzoic acid | CHEMBL89669
TypeSmall organic molecule
Emp. Form.C20H20N2O8
Mol. Mass.416.3814
SMILESOC(=O)c1cc(O)ccc1NC(=O)CCCCC(=O)Nc1ccc(O)cc1C(O)=O