Reaction Details
TargetReverse transcriptase/RNaseH
LigandBDBM50071776
Substrate/Competitorn/a
Meas. Tech.ChEMBL_196364 (CHEMBL805997)
IC50 1800±n/a nM
Citation Milton, JSlater, MJBird, AJSpinks, DScott, GPrice, CEDowning, SGreen, DVMadar, SBethell, RStammers, DK Biaryl acids: novel non-nucleoside inhibitors of HIV reverse transcriptase types 1 and 2. Bioorg Med Chem Lett8:2623-8 (1999) Reverse transcriptase/RNaseH
Name:Reverse transcriptase/RNaseH
Type:PROTEIN
Mol. Mass.:65229.15
Organism:Human immunodeficiency virus 1
Description:ChEMBL_1473730
Residue:566
BDBM50071776
NameBDBM50071776
Synonyms:2-({6-[(2-carboxy-4-chlorophenyl)amino]-6-oxohexanoyl}amino)-5-chlorobenzoic acid | CHEMBL89524
TypeSmall organic molecule
Emp. Form.C20H18Cl2N2O6
Mol. Mass.453.273
SMILESOC(=O)c1cc(Cl)ccc1NC(=O)CCCCC(=O)Nc1ccc(Cl)cc1C(O)=O