Reaction Details
TargetcGMP-specific 3',5'-cyclic phosphodiesterase
LigandBDBM14361
Substrate/Competitorn/a
Meas. Tech.ChEBML_155370
IC50 200000±n/a nM
Citation Montana, JGBuckley, GMCooper, NDyke, HJGowers, LGregory, JPHellewell, PGKendall, HJLowe, CMaxey, RMiotla, JNaylor, RJRuncie, KATuladhar, BWarneck, JB Aryl sulfonamides as selective PDE4 inhibitors. Bioorg Med Chem Lett8:2635-40 (1999) cGMP-specific 3',5'-cyclic phosphodiesterase
Name:cGMP-specific 3',5'-cyclic phosphodiesterase
Type:Protein
Mol. Mass.:99975.83
Organism:Homo sapiens (Human)
Description:O76074
Residue:875
BDBM14361
NameBDBM14361
Synonyms:(R,S)-Rolipram 4-[3-(cyclopentyloxy)-4-methoxyphenyl]pyrrolidin-2-one CHEMBL63 | Rolipram
TypeSmall organic molecule
Emp. Form.C16H21NO3
Mol. Mass.275.3428
SMILESCOc1ccc(cc1OC1CCCC1)C1CNC(=O)C1