Reaction Details
TargetCalpain-1 catalytic subunit
LigandBDBM50071825
Substrate/Competitorn/a
Meas. Tech.ChEBML_43648
IC50 14±n/a nM
Citation Tripathy, RGu, ZQDunn, DSenadhi, SEAtor, MAChatterjee, S P2-proline-derived inhibitors of calpain I. Bioorg Med Chem Lett8:2647-52 (1999) Calpain-1 catalytic subunit
Name:Calpain-1 catalytic subunit
Type:Protein
Mol. Mass.:81880.51
Organism:Homo sapiens (Human)
Description:n/a
Residue:714
BDBM50071825
NameBDBM50071825
Synonyms:(R)-1-(Toluene-4-sulfonyl)-pyrrolidine-2-carboxylic acid ((S)-1-benzyl-2-oxo-ethyl)-amide | CHEMBL316010
TypeSmall organic molecule
Emp. Form.C21H24N2O4S
Mol. Mass.400.491
SMILESCc1ccc(cc1)S(=O)(=O)N1CCC[C@@H]1C(=O)N[C@@H](Cc1ccccc1)C=O