Reaction Details
TargetMitogen-activated protein kinase 11
LigandBDBM50071867
Substrate/Competitorn/a
Meas. Tech.ChEBML_124652
IC50 10±n/a nM
Citation de Laszlo, SEVisco, DAgarwal, LChang, LChin, JCroft, GForsyth, AFletcher, DFrantz, BHacker, CHanlon, WHarper, CKostura, MLi, BLuell, SMacCoss, MMantlo, NO'Neill, EAOrevillo, CPang, MParsons, JRolando, ASahly, YSidler, KO'Keefe, SJ Pyrroles and other heterocycles as inhibitors of p38 kinase. Bioorg Med Chem Lett8:2689-94 (1999) Mitogen-activated protein kinase 11
Name:Mitogen-activated protein kinase 11
Type:Enzyme Catalytic Domain
Mol. Mass.:41351.73
Organism:Homo sapiens (Human)
Description:gi_20128774
Residue:364
BDBM50071867
NameBDBM50071867
Synonyms:4-[2-(4-Fluoro-phenyl)-5-(4-methanesulfonyl-phenyl)-1H-pyrrol-3-yl]-pyridine | CHEMBL316275
TypeSmall organic molecule
Emp. Form.C22H17FN2O2S
Mol. Mass.392.446
SMILESCS(=O)(=O)c1ccc(cc1)-c1cc(c([nH]1)-c1ccc(F)cc1)-c1ccncc1