Reaction Details
TargetRAF proto-oncogene serine/threonine-protein kinase
LigandBDBM50071867
Substrate/Competitorn/a
Meas. Tech.ChEBML_163340
IC50 500±n/a nM
Citation de Laszlo, SEVisco, DAgarwal, LChang, LChin, JCroft, GForsyth, AFletcher, DFrantz, BHacker, CHanlon, WHarper, CKostura, MLi, BLuell, SMacCoss, MMantlo, NO'Neill, EAOrevillo, CPang, MParsons, JRolando, ASahly, YSidler, KO'Keefe, SJ Pyrroles and other heterocycles as inhibitors of p38 kinase. Bioorg Med Chem Lett8:2689-94 (1999) RAF proto-oncogene serine/threonine-protein kinase
Name:RAF proto-oncogene serine/threonine-protein kinase
Type:Serine/threonine-protein kinase
Mol. Mass.:73082.52
Organism:Homo sapiens (Human)
Description:P04049
Residue:648
BDBM50071867
NameBDBM50071867
Synonyms:4-[2-(4-Fluoro-phenyl)-5-(4-methanesulfonyl-phenyl)-1H-pyrrol-3-yl]-pyridine | CHEMBL316275
TypeSmall organic molecule
Emp. Form.C22H17FN2O2S
Mol. Mass.392.446
SMILESCS(=O)(=O)c1ccc(cc1)-c1cc(c([nH]1)-c1ccc(F)cc1)-c1ccncc1