Reaction Details
TargetNeutrophil elastase
LigandBDBM50071973
Substrate/Competitorn/a
Meas. Tech.ChEBML_96776
IC50 60±n/a nM
Citation Llinàs-Brunet, MBailey, MDéziel, RFazal, GGorys, VGoulet, SHalmos, TMaurice, RPoirier, MPoupart, MARancourt, JThibeault, DWernic, DLamarre, D Studies on the C-terminal of hexapeptide inhibitors of the hepatitis C virus serine protease. Bioorg Med Chem Lett8:2719-24 (1999) Neutrophil elastase
Name:Neutrophil elastase
Type:Enzyme
Mol. Mass.:28532.38
Organism:Homo sapiens (Human)
Description:P08246
Residue:267
BDBM50071973
NameBDBM50071973
Synonyms:(S)-3-((S)-2-Acetylamino-3-carboxy-propionylamino)-N-((1S,2S)-2-methyl-1-{(S)-2-methyl-1-[2-((S)-3,3,4,4,4-pentafluoro-2-oxo-1-propyl-butylcarbamoyl)-pyrrolidine-1-carbonyl]-propylcarbamoyl}-butyl)-succinamic acid | CHEMBL2370192
TypeSmall organic molecule
Emp. Form.C33H49F5N6O11
Mol. Mass.800.7678
SMILESCCC[C@H](NC(=O)[C@@H]1CCCN1C(=O)[C@@H](NC(=O)[C@@H](NC(=O)[C@@H](CC(O)=O)NC(=O)[C@H](CC(O)=O)NC(C)=O)[C@@H](C)CC)C(C)C)C(=O)C(F)(F)C(F)(F)F