Reaction Details
TargetChymotrypsin-like elastase family member 1/2A
LigandBDBM50071973
Substrate/Competitorn/a
Meas. Tech.ChEBML_152345
IC50<60±n/a nM
Citation Llinàs-Brunet, MBailey, MDéziel, RFazal, GGorys, VGoulet, SHalmos, TMaurice, RPoirier, MPoupart, MARancourt, JThibeault, DWernic, DLamarre, D Studies on the C-terminal of hexapeptide inhibitors of the hepatitis C virus serine protease. Bioorg Med Chem Lett8:2719-24 (1999) Chymotrypsin-like elastase family member 1/2A
Name:Chymotrypsin-like elastase family member 1/2A
Synonyms:Pancreatic elastase
Type:n/a
Mol. Mass.:n/a
Description:ASSAY_ID of ChEMBL is 152345
Components:This complex has 2 components.
Component 1
Name:Chymotrypsin-like elastase family member 1
Type:Enzyme
Mol. Mass.:28827.71
Organism:Sus scrofa (Pig)
Description:P00772
Residue:266
Component 2
Name:Chymotrypsin-like elastase family member 2A
Synonyms:CEL2A_PIG ELA2 Elastase 2A Elastase-2A | Pancreatic elastase
Type:PROTEIN
Mol. Mass.:28705.23
Organism:Sus scrofa
Description:ChEMBL_156951
Residue:269
BDBM50071973
NameBDBM50071973
Synonyms:(S)-3-((S)-2-Acetylamino-3-carboxy-propionylamino)-N-((1S,2S)-2-methyl-1-{(S)-2-methyl-1-[2-((S)-3,3,4,4,4-pentafluoro-2-oxo-1-propyl-butylcarbamoyl)-pyrrolidine-1-carbonyl]-propylcarbamoyl}-butyl)-succinamic acid | CHEMBL2370192
TypeSmall organic molecule
Emp. Form.C33H49F5N6O11
Mol. Mass.800.7678
SMILESCCC[C@H](NC(=O)[C@@H]1CCCN1C(=O)[C@@H](NC(=O)[C@@H](NC(=O)[C@@H](CC(O)=O)NC(=O)[C@H](CC(O)=O)NC(C)=O)[C@@H](C)CC)C(C)C)C(=O)C(F)(F)C(F)(F)F