Reaction Details
TargetGenome polyprotein/Non-structural protein 4A
LigandBDBM50071964
Substrate/Competitorn/a
Meas. Tech.ChEMBL_143630 (CHEMBL752791)
IC50 17000±n/a nM
Citation Llinàs-Brunet, MBailey, MDéziel, RFazal, GGorys, VGoulet, SHalmos, TMaurice, RPoirier, MPoupart, MARancourt, JThibeault, DWernic, DLamarre, D Studies on the C-terminal of hexapeptide inhibitors of the hepatitis C virus serine protease. Bioorg Med Chem Lett8:2719-24 (1999) Genome polyprotein/Non-structural protein 4A
Name:Genome polyprotein/Non-structural protein 4A
Synonyms:Hepatitis C virus serine protease, NS3/NS4A
Type:n/a
Mol. Mass.:n/a
Description:ASSAY_ID of ChEMBL is 1969955
Components:This complex has 2 components.
Component 1
Name:Non-structural protein 4A
Type:PROTEIN
Mol. Mass.:5762.65
Organism:Hepatitis C virus
Description:ChEMBL_305334
Residue:54
Component 2
Name:Genome polyprotein
Synonyms:Hepatitis C virus NS3 protease/helicase | Hepatitis C virus serine protease, NS3/NS4A
Type:Protein
Mol. Mass.:67067.41
Organism:Hepatitis C virus
Description:A3EZI9
Residue:631
BDBM50071964
NameBDBM50071964
Synonyms:(R)-2-{[1-((S)-2-{(2S,3S)-2-[(R)-2-((S)-2-Acetylamino-3-carboxy-propionylamino)-3-carboxy-propionylamino]-3-methyl-pentanoylamino}-3-methyl-butyryl)-pyrrolidine-2-carbonyl]-amino}-pentanoic acid methyl ester | CHEMBL2370174
TypeSmall organic molecule
Emp. Form.C32H52N6O12
Mol. Mass.712.7883
SMILESCCC[C@@H](NC(=O)[C@@H]1CCCN1C(=O)[C@@H](NC(=O)[C@@H](NC(=O)[C@@H](CC(O)=O)NC(=O)[C@H](CC(O)=O)NC(C)=O)[C@@H](C)CC)C(C)C)C(=O)OC