Reaction Details
TargetChymotrypsin-like elastase family member 1/2A
LigandBDBM50071968
Substrate/Competitorn/a
Meas. Tech.ChEBML_152345
IC50<60±n/a nM
Citation Llinàs-Brunet, MBailey, MDéziel, RFazal, GGorys, VGoulet, SHalmos, TMaurice, RPoirier, MPoupart, MARancourt, JThibeault, DWernic, DLamarre, D Studies on the C-terminal of hexapeptide inhibitors of the hepatitis C virus serine protease. Bioorg Med Chem Lett8:2719-24 (1999) Chymotrypsin-like elastase family member 1/2A
Name:Chymotrypsin-like elastase family member 1/2A
Synonyms:Pancreatic elastase
Type:n/a
Mol. Mass.:n/a
Description:ASSAY_ID of ChEMBL is 152345
Components:This complex has 2 components.
Component 1
Name:Chymotrypsin-like elastase family member 1
Type:Enzyme
Mol. Mass.:28827.71
Organism:Sus scrofa (Pig)
Description:P00772
Residue:266
Component 2
Name:Chymotrypsin-like elastase family member 2A
Synonyms:CEL2A_PIG ELA2 Elastase 2A Elastase-2A | Pancreatic elastase
Type:PROTEIN
Mol. Mass.:28705.23
Organism:Sus scrofa
Description:ChEMBL_156951
Residue:269
BDBM50071968
NameBDBM50071968
Synonyms:(S)-3-((S)-2-Acetylamino-3-carboxy-propionylamino)-N-((1S,2S)-1-{(S)-1-[2-((S)-1-benzylaminooxalyl-butylcarbamoyl)-pyrrolidine-1-carbonyl]-2-methyl-propylcarbamoyl}-2-methyl-butyl)-succinamic acid | CHEMBL2370184
TypeSmall organic molecule
Emp. Form.C39H57N7O12
Mol. Mass.815.9096
SMILESCCC[C@H](NC(=O)[C@@H]1CCCN1C(=O)[C@@H](NC(=O)[C@@H](NC(=O)[C@@H](CC(O)=O)NC(=O)[C@H](CC(O)=O)NC(C)=O)[C@@H](C)CC)C(C)C)C(=O)C(=O)NCc1ccccc1