Reaction Details
TargetGenome polyprotein/Non-structural protein 4A
LigandBDBM50071966
Substrate/Competitorn/a
Meas. Tech.ChEMBL_143630 (CHEMBL752791)
IC50 2000±n/a nM
Citation Llinàs-Brunet, MBailey, MDéziel, RFazal, GGorys, VGoulet, SHalmos, TMaurice, RPoirier, MPoupart, MARancourt, JThibeault, DWernic, DLamarre, D Studies on the C-terminal of hexapeptide inhibitors of the hepatitis C virus serine protease. Bioorg Med Chem Lett8:2719-24 (1999) Genome polyprotein/Non-structural protein 4A
Name:Genome polyprotein/Non-structural protein 4A
Synonyms:Hepatitis C virus serine protease, NS3/NS4A
Type:n/a
Mol. Mass.:n/a
Description:ASSAY_ID of ChEMBL is 1969955
Components:This complex has 2 components.
Component 1
Name:Non-structural protein 4A
Type:PROTEIN
Mol. Mass.:5762.65
Organism:Hepatitis C virus
Description:ChEMBL_305334
Residue:54
Component 2
Name:Genome polyprotein
Synonyms:Hepatitis C virus NS3 protease/helicase | Hepatitis C virus serine protease, NS3/NS4A
Type:Protein
Mol. Mass.:67067.41
Organism:Hepatitis C virus
Description:A3EZI9
Residue:631
BDBM50071966
NameBDBM50071966
Synonyms:(R)-3-((S)-2-Acetylamino-3-carboxy-propionylamino)-N-((1S,2S)-1-{(S)-1-[2-((S)-1-benzylaminooxalyl-butylcarbamoyl)-pyrrolidine-1-carbonyl]-2-methyl-propylcarbamoyl}-2-methyl-butyl)-succinamic acid | CHEMBL2370179
TypeSmall organic molecule
Emp. Form.C39H57N7O12
Mol. Mass.815.9096
SMILESCCC[C@H](NC(=O)[C@@H]1CCCN1C(=O)[C@@H](NC(=O)[C@@H](NC(=O)[C@H](CC(O)=O)NC(=O)[C@H](CC(O)=O)NC(C)=O)[C@@H](C)CC)C(C)C)C(=O)C(=O)NCc1ccccc1