Reaction Details
TargetProgesterone receptor
LigandBDBM50072020
Substrate/Competitorn/a
Meas. Tech.ChEBML_159728
Ki 2580±n/a nM
Citation Hamann, LGWinn, DTPooley, CLTegley, CMWest, SJFarmer, LJZhi, LEdwards, JPMarschke, KBMais, DEGoldman, MEJones, TK Nonsteroidal progesterone receptor antagonists based on a conformationally-restricted subseries of 6-aryl-1,2-dihydro-2,2,4-trimethylquinolines. Bioorg Med Chem Lett8:2731-6 (1999) Progesterone receptor
Name:Progesterone receptor
Type:Protein
Mol. Mass.:98979.52
Organism:Homo sapiens (Human)
Description:P06401
Residue:933
BDBM50072020
NameBDBM50072020
Synonyms:6,9-Difluoro-1,3,3-trimethyl-4,11-dihydro-3H-indeno[2,1-f]quinolin-11-ol | CHEMBL92777
TypeSmall organic molecule
Emp. Form.C19H17F2NO
Mol. Mass.313.3412
SMILESCC1=CC(C)(C)Nc2cc(F)c3-c4ccc(F)cc4C(O)c3c12